Modulenotfounderror no module named xgboost

Oct 23, 2020 · 网上查阅博客发现,ModuleNotFoundError: No module named 'xgboost',报错一般是python的xgboost没有装好, 但是在我的cmd中,是可以import xgboost的: 然而到了spyder中,就会报import错误 后来也是查阅博客发现,在spyder里面import,他自动搜索几个文件夹,然而我安装的xgboost并不在它 ... .

No module named 'xgboost' when using pickle. Hi, I am trying to deploy a xgboost classifier using streamlit. I have the model trained in a jupyter notebook file in a different folder. in the folder that has the streamlit python script, i have installed venv and im running the app through the virtual environment. streamlit works perfectly but ...Hi Team, When i trying to execute , XGBOOST , i am getting the following error "ModuleNotFoundError: No module named ‘xgboost’ " Could you please help me in ...

Did you know?

Dec 22, 2018 · 2 Answers. conda activate boost conda install -c conda-forge spyder xgboost catboost lightgbm. Create a conda env to install all packages that come from conda-forge. That's because conda-forge packages are binary incompatible with the default packages provided by Anaconda. Read our guide to understand how to connect Spyder to different Python ... 12 May 2023 ... Python 3 - ModuleNotFoundError: No module named 'xgboost', ImportError: No module named xgboost, ImportError: No module named 'xgboost', ...Xgboost is a supervised learning library that is used for classification as well as regeneration. It implements ML algorithms under the Gradient Boosting framework, and it provides a parallel tree boosting (also known as GBDT, GBM) which solves many data science problems in a fast and accurate way. ... You can import this module in your …ModuleNotFoundError: No module named 'xgboost' Although I write : !pip3 install xgboost It prints that :

Jul 5, 2017 · You can execute the following instructions and command to solve the issue: (do not include inverted commas) Open Anaconda Prompt; type: "create --name py3-TF2.0 python = 3" I have also included the deployment logs for a successful deployment in another environmentOk, I managed to get past this problem, but I'm not sure what the fix implies. I had dask_xgboost installing as EXTRA_PIP_PACKAGES on both client dask-notebook and on Dask Workers, but not on the Dask Scheduler. Installing dask_xgboost on the Scheduler pod/container as well resolves this problem.. Should that be required? I'm not across everything the Scheduler does, but is it involved in:The problem was that VScode sys.path showed python38-32 but the module was installed in python39.To fix the issue go to View -> Command pallete -> select interpreter and make sure to use the version under which pip installed the module.. This answered my question. How can I change python version in Visual Studio Code?This issue still persists after running pip install numpy, because you are running Python 3 and pip is a package for Python 2.So the above command will install pip for Python 2. For Python 3, you have to install pip3 by running the command sudo apt install python3-pip and now install NumPy using the command sudo pip3 install numpy.

I have also included the deployment logs for a successful deployment in another environmentClick on "Environments" and select your project. Type py-xgboost in the search bar to the right. Tick the py-xgboost package and click on "Apply". Alternatively, you can install the xgboost package with a command. If you are on Windows, search for "Anaconda Prompt" and open the application. ….

Reader Q&A - also see RECOMMENDED ARTICLES & FAQs. Modulenotfounderror no module named xgboost. Possible cause: Not clear modulenotfounderror no module named xgboost.

import xgboost as xgb. ModuleNotFoundError Traceback (most recent call last) in () —-> 1 import xgboost as xgb. ModuleNotFoundError: No module named 'xgboost'.Here are the best solutions to solve no module named xgboost. Solution 1: Install using pip package in Python 2. PIP is the simplest and best solution to install this XGBOOST module. These are the command for installation: " pip install xgboost ". Solution 2: Install using pip package in Python 3. The following command for installation in ...

ImportError: No module named xgboost – Python Easy fix to Python ModuleNotFoundError: No module named … [azure functions][python] ModuleNotFoundError: No ...Regression model based on XGBoost. This implementation comes with the ability to produce probabilistic forecasts. class darts.models.forecasting.xgboost.XGBModel(lags=None, lags_past_covariates=None, lags_future_covariates=None, output_chunk_length=1, add_encoders=None, likelihood=None, quantiles=None, random_state=None, multi_models=True, use ...Hi, I have tried to deploy an azure python function but get the following error: Exception while executing function: Functions.HttpTrigger <--- Result: Failure Exception: ModuleNotFoundError: No module named 'xgboost.core' Stack: File "/...import xgboost as xgb. ModuleNotFoundError Traceback (most recent call last) in () —-> 1 import xgboost as xgb. ModuleNotFoundError: No module named 'xgboost'.

Project description. A distributed backend for XGBoost built on top of distributed computing framework Ray.24 Mar 2023 ... ... xgboost dumpy SciPy pandas' etc. These modules work fine. … ... ModuleNotFoundError: No module named 'ROOT'. However, when just ...

As part of Lesson 4 of the ML course, I’m trying to import the pdpbox and plotnine packages into my Jupyter notebook on Crestle. However, I ended up with the following error: ModuleNotFoundError: No module named 'pdpbox' I have already pip-installed the pdpbox and plotnine packages into my Crestle machine. As for …I have also met this problem. Any command that starts with pip have the same error, ImportError: No module named 'typing'. Finally, python -m pip install typing solved it. Share. Follow edited Sep 10, 2021 at 5:40. Peter Mortensen ... No module named whaaaaat ModuleNotFoundError? 14. Python: "no module named pip" 1.

icd 10 right hip labral tear Jan 2, 2023 · from xgboost.spark import SparkXGBClassifierModel model2 = SparkXGBClassifierModel.load ("xgboost-model") Assuming this means there is a format difference if the model had originally been trained as a SparkXGBoost model. I replicated this issue and yes, it appears that SparkXGBClassifierModel expects a different model format when loading. dte outage map milford mi No idea how to fix the missing 'imp' module. I tried to read and apply every solution found in the internet or google. I used the command 'conda install multiqc' to install multiqc in the existing conda environment. I tried to install it in a new conda environment. Still, its showing the same message.The python version currently running is 3.12.0.2. That means that the installation you made was not done properly, so when you type in requests to get the module in your script it cannot find it. Just reinstall it properly with (if the prompt for the python version you want to use is simply python ): python -m pip install requests. EDIT: fleet farm alexandria mn hours 1 Answer Sorted by: 9 I was able to solve my issue. Simply update scikit-learn from 0.21.3 to 0.22.0 seems to solve the issue. Along the way I have to update my pandas version to 0.25.2 as well. The cue is provided in this link: https://www.gitmemory.com/vruusmann, where it states:"ModuleNotFoundError: No module named <package>" in my Docker container. 5. ModuleNotFoundError: No moudle name <name> in docker python. 3. Python module not found when using Docker. 1. Python Docker container, Module not found. 1. Python Modules in Docker: ModuleNotFoundError: No module named 'src' 6. craftsman t2200 drive belt No idea how to fix the missing 'imp' module. I tried to read and apply every solution found in the internet or google. I used the command 'conda install multiqc' to …No module named 'mlxtend' Ask Question Asked 4 years, 3 months ago. Modified 1 year, 4 months ago. ... ModuleNotFoundError: No module named 'mlxtend' 14. mithril pickaxe osrs 3 Eyl 2022 ... Jupyter上报:ModuleNotFoundError: No module named 'xgboost' 原创 · 打开cmd,输入python后,再输入import xgboost · 复制下面的代码即可.You can execute the following instructions and command to solve the issue: (do not include inverted commas) Open Anaconda Prompt; type: "create --name py3-TF2.0 python = 3" fallout 76 razorgrain locations Sep 10, 2020 · 4、解决:指定源安装. 知道了问题的原因,就能很快找到解决问题的办法,所以一定要看引起问题的原因... 直接复制地址到浏览器尝试下载,每秒0.1kb的速度... 难怪超时了!. 结果:可以看到成功安装上了xgboost!. 如果存在多个版本python,可以使用pip -V查看pip ... Python :: 3.11. For a stable version, install using. pip install xgboost. For building from source, see. View statistics for this project via our public dataset on Google BigQuery. License: Apache Software License (Apache-2.0) Author: Requires: Python >=3.8. 5 - Production/Stable. noveske vs daniel defense 10 Şub 2022 ... How to resolve No module named 'pyspark' Error in Jupyter notebook and any python editor? In python when you try to import PySpark library ... mugshots alamance county nc Feb 24, 2023 · PySpark MLlib Cross Validation for hyperparameter tuning a XGBoost. I'm trying to make a search for a xbgoost's parameters with the cross validation from PySpark's MLlib. I'm using the module from xgboost that is compatible with pyspark's dataframes SparkXGBRegressor. My dataframe has 40 columns and 6 million rows. Running the Helm Chart latest version, with: - name: EXTRA_PIP_PACKAGES value: s3fs dask-ml dask-xgboost --upgrade k8s Dask worker … blue alv 196 The Reason for modulenotfounderror: no module named ‘xgboost’ is either xgboost is not installed or misconfigured in the system. The best way to fix this error is to reinstall this xgboost python module. Since most of the Machine Learning Algorithm come in a bundle all together for example scikit-learn. But that is not the case with XGBOOST. I have installed the xgboost using the instruction given for Python windows. I have used VS2013 to build the solution. Everything was successand i saw the below message. Build: 3 succeeded, 0 failed, 0 up-to-date, 0 skipped ===== I searched for xgboost app and xgboost.dll file location and mapped it in the script as below - import sys fresh grocer careersarcade 1up clearance No idea how to fix the missing 'imp' module. I tried to read and apply every solution found in the internet or google. I used the command 'conda install multiqc' to install multiqc in the existing conda environment. I tried to install it in a new conda environment. Still, its showing the same message.The python version currently running is 3.12.0. brookhaven funeral home brookhaven ms obituaries To get the path from where your packages are imported, you may use: import site site.getsitepackages () # /your/path/from/python. Then you may check in terminal where pip installs your packages : pip show imblearn. If the paths do not coincide, you may manually set the path for pip in terminal: round rock gas prices To fix the no module named keras exception, proceed as following: In your Python environment, open your command prompt or Anaconda prompt. Run the pip install keras command to install the library. If using Anaconda run conda install keras. Close your command prompt and call keras from your Python script. lowes north richland hills The error ModuleNotFoundError: No module named xgboost occurs when Python can’t find the xgboost module from your current environment. This error … adrianne bradshaw spectrum news Jan 30, 2019 · I have used mvn package and install inside jvm-packages of xgboost but it seems it did not add it.(mvn ended with success on everything) – SSh Jan 30, 2019 at 12:42 This article already gives you an effective solution that will help to resolve the error modulenotfounderror no module named ‘xgboost’ jupyter notebook. By … why won't my villager change jobs I just found out that this issue is duplicated with this issue right after I hit the submit button (sorry guys).. According to the answer, the root issue is that when we run mlflow run <project_name> it actually uses the Python of the base environment, in which there is no mlflow installed (although I run the mlflow run command in my working environment that already installed MLFlow).On the top of the Jupyter window, click the "Kernel" drop-down menu. Move the mouse over "Change kernel". Then, I could see a list of different Python conda environments. I noticed that the one that was selected was for Tensorflow. I changed the kernel to. I have installed pytorch in virtual environment. When I am trying to execute import torch ...Hi, The XGBoost is an implementation of gradient boosted decision trees algorithm and it is designed for higher performance. The XGBoost gives speed and performance in machine learning applications. torcon weather Click on "Environments" and select your project. Type py-xgboost in the search bar to the right. Tick the py-xgboost package and click on "Apply". Alternatively, you can install the xgboost package with a command. If you are on Windows, search for "Anaconda Prompt" and open the application. apscore calculator 警告はでるもののバージョンが上がっていることが確認できた。. そしてxgboostを再びインストールする。. 先程の警告に従って python3 -m pip を用いてインストールした。. 無事インストールが完了!. ImportError: No module named xgboostを解決する方法xgboostを ...modulenotfounderror: no module named 'xgboost' ( Solved ) The Reason for modulenotfounderror: no module named 'xgboost' is either xgboost is not installed or misconfigured in the system. The best way to fix this error is to reinstall this xgboost python module. west md craigslist A file named xgboost.py overwrites the module you're trying to load. You'll need to make sure there are no files of that name in your working directory. – MicrobicTiger1. TensorFlow package doesn't come by default with the root environment in Jupyter, to install it do the following : Close Jupyter Notebook. Open Anaconda Navigator (In windows : you can find it using the search bar) On the sidebar, click on the Environments tab (by default you are using the root env). bolt pattern 2005 dodge ram 1500 ModuleNotFoundError: No module named 'numpy' What do I do? python-3.x; numpy; Share. Improve this question. Follow edited Aug 22, 2022 at 15:02. Peter Mortensen. 30.8k 21 21 gold badges 105 105 silver badges 131 131 bronze badges. asked Jan 3, 2020 at 8:08. user3576608 user3576608.ImportError: No module named 'tensorflow.python'; 'tensorflow' is not a package. 10. ModuleNotFoundError: No module named 'tf' 0. AttributeError: module 'tensorflow' has no attribute 'python' in Keras Tensorflow. 0. No module named 'tensorflow.keras' 0.Apr 25, 2017 · XGBoost: AttributeError: 'DataFrame' object has no attribute 'feature_names' 0 Python 3 - ModuleNotFoundError: No module named 'xgboost' ]